Reaction Details
TargetSerine-protein kinase ATM
LigandBDBM50144964
Substrate/Competitorn/a
Meas. Tech.ChEMBL_1556115 (CHEMBL3768359)
IC50 1600±n/a nM
Citation Min, JGuo, KSuryadevara, PKZhu, FHolbrook, GChen, YFeau, CYoung, BMLemoff, AConnelly, MCKastan, MBGuy, RK Optimization of a Novel Series of Ataxia-Telangiectasia Mutated Kinase Inhibitors as Potential Radiosensitizing Agents. J Med Chem59:559-77 (2016) 
 
Serine-protein kinase ATM
Name:Serine-protein kinase ATM
Type:Protein
Mol. Mass.:350696.72
Organism:Homo sapiens (Human)
Description:Q13315
Residue:3056
BDBM50144964
NameBDBM50144964
Synonyms:CHEMBL3763863
TypeSmall organic molecule
Emp. Form.C25H30N8O3
Mol. Mass.490.5575
SMILESCOc1cc2ncnc(-n3nc(nc3N)-c3ccccn3)c2cc1OCCCN1CC(C)OC(C)C1