Reaction Details
TargetSerine-protein kinase ATM
LigandBDBM50144984
Substrate/Competitorn/a
Meas. Tech.ChEMBL_1556115 (CHEMBL3768359)
IC50 12500±n/a nM
Citation Min, JGuo, KSuryadevara, PKZhu, FHolbrook, GChen, YFeau, CYoung, BMLemoff, AConnelly, MCKastan, MBGuy, RK Optimization of a Novel Series of Ataxia-Telangiectasia Mutated Kinase Inhibitors as Potential Radiosensitizing Agents. J Med Chem59:559-77 (2016) 
 
Serine-protein kinase ATM
Name:Serine-protein kinase ATM
Type:Protein
Mol. Mass.:350696.72
Organism:Homo sapiens (Human)
Description:Q13315
Residue:3056
BDBM50144984
NameBDBM50144984
Synonyms:CHEMBL3764259
TypeSmall organic molecule
Emp. Form.C21H18N4O2
Mol. Mass.358.3932
SMILESCOc1cc2ncnc(Nc3ccc(cc3)-c3ccccn3)c2cc1OC