Reaction Details
TargetSerine-protein kinase ATM
LigandBDBM50144997
Substrate/Competitorn/a
Meas. Tech.ChEMBL_1556115 (CHEMBL3768359)
IC50 2300±n/a nM
Citation Min, JGuo, KSuryadevara, PKZhu, FHolbrook, GChen, YFeau, CYoung, BMLemoff, AConnelly, MCKastan, MBGuy, RK Optimization of a Novel Series of Ataxia-Telangiectasia Mutated Kinase Inhibitors as Potential Radiosensitizing Agents. J Med Chem59:559-77 (2016) 
 
Serine-protein kinase ATM
Name:Serine-protein kinase ATM
Type:Protein
Mol. Mass.:350696.72
Organism:Homo sapiens (Human)
Description:Q13315
Residue:3056
BDBM50144997
NameBDBM50144997
Synonyms:CHEMBL3764300
TypeSmall organic molecule
Emp. Form.C21H23N7O4
Mol. Mass.437.4518
SMILESCOCCOc1cc2ncnc(-n3nc(nc3N)-c3ccccn3)c2cc1OCCOC