Reaction Details
TargetSerine-protein kinase ATM
LigandBDBM50145003
Substrate/Competitorn/a
Meas. Tech.ChEMBL_1556115 (CHEMBL3768359)
IC50 5000±n/a nM
Citation Min, JGuo, KSuryadevara, PKZhu, FHolbrook, GChen, YFeau, CYoung, BMLemoff, AConnelly, MCKastan, MBGuy, RK Optimization of a Novel Series of Ataxia-Telangiectasia Mutated Kinase Inhibitors as Potential Radiosensitizing Agents. J Med Chem59:559-77 (2016) 
 
Serine-protein kinase ATM
Name:Serine-protein kinase ATM
Type:Protein
Mol. Mass.:350696.72
Organism:Homo sapiens (Human)
Description:Q13315
Residue:3056
BDBM50145003
NameBDBM50145003
Synonyms:CHEMBL3765732
TypeSmall organic molecule
Emp. Form.C17H15N7O2
Mol. Mass.349.3467
SMILESCOc1cc2ncnc(-n3nc(nc3N)-c3ccncc3)c2cc1OC