Reaction Details
TargetPoly [ADP-ribose] polymerase 1
LigandBDBM50145151
Substrate/Competitorn/a
Meas. Tech.ChEMBL_1553353 (CHEMBL3767923)
IC50 1.6±n/a nM
Citation Wang, BChu, DFeng, YShen, YAoyagi-Scharber, MPost, LE Discovery and Characterization of (8S,9R)-5-Fluoro-8-(4-fluorophenyl)-9-(1-methyl-1H-1,2,4-triazol-5-yl)-2,7,8,9-tetrahydro-3H-pyrido[4,3,2-de]phthalazin-3-one (BMN 673, Talazoparib), a Novel, Highly Potent, and Orally Efficacious Poly(ADP-ribose) Polymerase-1/2 Inhibitor, as an Anticancer Agent. J Med Chem59:335-57 (2016) 
 
Poly [ADP-ribose] polymerase 1
Name:Poly [ADP-ribose] polymerase 1
Type:n/a
Mol. Mass.:113114.22
Organism:Homo sapiens (Human)
Description:P09874
Residue:1014
BDBM50145151
NameBDBM50145151
Synonyms:CHEMBL3764202
TypeSmall organic molecule
Emp. Form.C20H15F2N5O
Mol. Mass.379.3628
SMILESCn1ccnc1[C@@H]1[C@H](Nc2cc(F)cc3c2c1n[nH]c3=O)c1ccc(F)cc1