Reaction Details
TargetIndoleamine 2,3-dioxygenase 1
LigandBDBM50145161
Substrate/Competitorn/a
Meas. Tech.ChEMBL_1553783 (CHEMBL3766998)
IC50 73±n/a nM
Citation Lin, SYYeh, TKKuo, CCSong, JSCheng, MFLiao, FYChao, MWHuang, HLChen, YLYang, CYWu, MHHsieh, CLHsiao, WPeng, YHWu, JSLin, LMSun, MChao, YSShih, CWu, SYPan, SLHung, MSUeng, SH Phenyl Benzenesulfonylhydrazides Exhibit Selective Indoleamine 2,3-Dioxygenase Inhibition with Potent in Vivo Pharmacodynamic Activity and Antitumor Efficacy. J Med Chem59:419-30 (2016) 
 
Indoleamine 2,3-dioxygenase 1
Name:Indoleamine 2,3-dioxygenase 1
Type:Enzyme
Mol. Mass.:45330.80
Organism:Homo sapiens (Human)
Description:P14902
Residue:403
BDBM50145161
NameBDBM50145161
Synonyms:CHEMBL3765545
TypeSmall organic molecule
Emp. Form.C15H14BrN3O3S
Mol. Mass.396.259
SMILESBrc1ccc(NNS(=O)(=O)c2ccc3NC(=O)CCc3c2)cc1