Reaction Details
TargetIndoleamine 2,3-dioxygenase 1
LigandBDBM50145157
Substrate/Competitorn/a
Meas. Tech.ChEMBL_1553580 (CHEMBL3769112)
EC50 68±n/a nM
Citation Lin, SYYeh, TKKuo, CCSong, JSCheng, MFLiao, FYChao, MWHuang, HLChen, YLYang, CYWu, MHHsieh, CLHsiao, WPeng, YHWu, JSLin, LMSun, MChao, YSShih, CWu, SYPan, SLHung, MSUeng, SH Phenyl Benzenesulfonylhydrazides Exhibit Selective Indoleamine 2,3-Dioxygenase Inhibition with Potent in Vivo Pharmacodynamic Activity and Antitumor Efficacy. J Med Chem59:419-30 (2016) 
 
Indoleamine 2,3-dioxygenase 1
Name:Indoleamine 2,3-dioxygenase 1
Type:Enzyme
Mol. Mass.:45330.80
Organism:Homo sapiens (Human)
Description:P14902
Residue:403
BDBM50145157
NameBDBM50145157
Synonyms:CHEMBL3763166
TypeSmall organic molecule
Emp. Form.C14H12BrN3O3S
Mol. Mass.382.232
SMILESBrc1ccc(NNS(=O)(=O)c2ccc3NC(=O)Cc3c2)cc1