Reaction Details
TargetIndoleamine 2,3-dioxygenase 1
LigandBDBM50145168
Substrate/Competitorn/a
Meas. Tech.ChEMBL_1553783 (CHEMBL3766998)
IC50 35±n/a nM
Citation Lin, SYYeh, TKKuo, CCSong, JSCheng, MFLiao, FYChao, MWHuang, HLChen, YLYang, CYWu, MHHsieh, CLHsiao, WPeng, YHWu, JSLin, LMSun, MChao, YSShih, CWu, SYPan, SLHung, MSUeng, SH Phenyl Benzenesulfonylhydrazides Exhibit Selective Indoleamine 2,3-Dioxygenase Inhibition with Potent in Vivo Pharmacodynamic Activity and Antitumor Efficacy. J Med Chem59:419-30 (2016) 
 
Indoleamine 2,3-dioxygenase 1
Name:Indoleamine 2,3-dioxygenase 1
Type:Enzyme
Mol. Mass.:45330.80
Organism:Homo sapiens (Human)
Description:P14902
Residue:403
BDBM50145168
NameBDBM50145168
Synonyms:CHEMBL3764319
TypeSmall organic molecule
Emp. Form.C16H16BrN3O3S
Mol. Mass.410.286
SMILESCC(=O)N1CCc2cc(ccc12)S(=O)(=O)NNc1ccc(Br)cc1