Reaction Details
TargetSerine/threonine-protein kinase B-raf
LigandBDBM50139148
Substrate/Competitorn/a
Meas. Tech.ChEMBL_1554489 (CHEMBL3767786)
IC50 2.9±n/a nM
Citation Huang, SCAdhikari, SAfroze, RBrewer, KCalderwood, EFChouitar, JEngland, DBFisher, CGalvin, KMGaulin, JGreenspan, PDHarrison, SJKim, MSLangston, SPMa, LTMenon, SMizutani, HRezaei, MSmith, MDZhang, DMGould, AE Optimization of tetrahydronaphthalene inhibitors of Raf with selectivity over hERG. Bioorg Med Chem Lett26:1156-60 (2016) 
 
Serine/threonine-protein kinase B-raf
Name:Serine/threonine-protein kinase B-raf
Type:Serine/threonine-protein kinase
Mol. Mass.:84446.00
Organism:Homo sapiens (Human)
Description:P15056
Residue:766
BDBM50139148
NameBDBM50139148
Synonyms:CHEMBL3764101
TypeSmall organic molecule
Emp. Form.C27H27Cl2F3N4O3
Mol. Mass.583.429
SMILESCl.Cl.NCc1cc(cc(c1)C(F)(F)F)C(=O)N[C@@H]1CCc2ccc(Oc3ccnc4NC(=O)CCc34)cc2C1