Reaction Details
TargetSerine/threonine-protein kinase B-raf
LigandBDBM50139158
Substrate/Competitorn/a
Meas. Tech.ChEMBL_1554490 (CHEMBL3767787)
IC50 34±n/a nM
Citation Huang, SCAdhikari, SAfroze, RBrewer, KCalderwood, EFChouitar, JEngland, DBFisher, CGalvin, KMGaulin, JGreenspan, PDHarrison, SJKim, MSLangston, SPMa, LTMenon, SMizutani, HRezaei, MSmith, MDZhang, DMGould, AE Optimization of tetrahydronaphthalene inhibitors of Raf with selectivity over hERG. Bioorg Med Chem Lett26:1156-60 (2016) 
 
Serine/threonine-protein kinase B-raf
Name:Serine/threonine-protein kinase B-raf
Type:Serine/threonine-protein kinase
Mol. Mass.:84446.00
Organism:Homo sapiens (Human)
Description:P15056
Residue:766
BDBM50139158
NameBDBM50139158
Synonyms:CHEMBL3763646
TypeSmall organic molecule
Emp. Form.C30H27ClF3N5O3
Mol. Mass.598.015
SMILESCl.Cn1cc(cn1)-c1cc(cc(c1)C(F)(F)F)C(=O)N[C@@H]1CCc2ccc(Oc3ccnc4NC(=O)CCc34)cc2C1