Reaction Details
TargetType-2 angiotensin II receptor
LigandBDBM50236697
Substrate/Competitorn/a
Meas. Tech.ChEMBL_1555129 (CHEMBL3768051)
Ki 0.200000±n/a nM
Citation Sallander, JWallinder, CHallberg, AÅqvist, JGutiérrez-de-Terán, H Structural determinants of subtype selectivity and functional activity of angiotensin II receptors. Bioorg Med Chem Lett26:1355-9 (2016) 
 
Type-2 angiotensin II receptor
Name:Type-2 angiotensin II receptor
Type:Enzyme Catalytic Domain
Mol. Mass.:41201.61
Organism:Homo sapiens (Human)
Description:Angiotensin II, central 0 0::P50052
Residue:363
BDBM50236697
NameBDBM50236697
Synonyms:5-L-isoleucineangiotensin II Angiotensin II CHEMBL408403 L-alpha-aspartyl-L-arginyl-L-valyl-L-tyrosyl-L-isoleucyl-L-histidyl-L-prolyl-L-phenylalanine US9624243, Angiotensin II angiotensin II (mouse) isoleucine(5)-angiotensin II
TypeSmall organic molecule
Emp. Form.C50H71N13O12
Mol. Mass.1046.1786
SMILESCC[C@H](C)[C@H](NC(=O)[C@H](Cc1ccc(O)cc1)NC(=O)[C@@H](NC(=O)[C@H](CCCN=C(N)N)NC(=O)[C@@H](N)CC(O)=O)C(C)C)C(=O)N[C@@H](Cc1cnc[nH]1)C(=O)N1CCC[C@H]1C(=O)N[C@@H](Cc1ccccc1)C(O)=O