Reaction Details
TargetPlatelet-activating factor receptor
LigandBDBM50145198
Substrate/Competitorn/a
Meas. Tech.ChEMBL_1555330 (CHEMBL3769214)
Ki 2000±n/a nM
Citation Layton, MEReif, AJHartingh, TJRodzinak, KDudkin, VWang, CArrington, KKelly, MJGarbaccio, RMO'Brien, JAMagliaro, BCUslaner, JMHuszar, SLFillgrove, KLTang, CKuo, YJacobson, MA Discovery of 5-aryl-1,3-dihydro-2H-imidazo[4,5-b]pyridin-2-ones as positive allosteric modulators of metabotropic glutamate subtype-2 (mGlu2) receptors with efficacy in a preclinical model of psychosis. Bioorg Med Chem Lett26:1260-4 (2016) 
 
Platelet-activating factor receptor
Name:Platelet-activating factor receptor
Type:Enzyme Catalytic Domain
Mol. Mass.:39219.60
Organism:Homo sapiens (Human)
Description:PAF Platelet activating factor PTAFR HUMAN::P25105
Residue:342
BDBM50145198
NameBDBM50145198
Synonyms:CHEMBL3765778
TypeSmall organic molecule
Emp. Form.C22H29N3O2
Mol. Mass.367.4846
SMILESCc1ccc(cc1-c1ccc2n(CC(C)(C)C)c(=O)n(C)c2n1)C(C)(C)O