Reaction Details
TargetLow-density lipoprotein receptor-related protein 6
LigandBDBM50145384
Substrate/Competitorn/a
Meas. Tech.ChEMBL_1555558 (CHEMBL3768328)
IC50 4060±n/a nM
Citation Thysiadis, SMpousis, SAvramidis, NKatsamakas, SBalomenos, ARemelli, REfthimiopoulos, SSarli, V Discovery of novel phenoxazinone derivatives as DKK1/LRP6 interaction inhibitors: Synthesis, biological evaluation and structure-activity relationships. Bioorg Med Chem24:1014-22 (2016) 
 
Low-density lipoprotein receptor-related protein 6
Name:Low-density lipoprotein receptor-related protein 6
Type:PROTEIN
Mol. Mass.:180387.57
Organism:Homo sapiens (Human)
Description:ChEMBL_116698
Residue:1613
BDBM50145384
NameBDBM50145384
Synonyms:CHEMBL3764205
TypeSmall organic molecule
Emp. Form.C22H25N3O5
Mol. Mass.411.451
SMILESCOC(=O)c1c(NC2CCCCC2)c(=O)c(O)c2oc3cc(ccc3nc12)N(C)C