Reaction Details
Target5-hydroxytryptamine receptor 2C
LigandBDBM50145624
Substrate/Competitorn/a
Meas. Tech.ChEMBL_1556022 (CHEMBL3767686)
Ki 0.156000±n/a nM
Citation Fiorino, FCiano, AMagli, ESeverino, BCorvino, APerissutti, EFrecentese, FDi Vaio, PIzzo, AACapasso, RMassarelli, PNencini, CRossi, IKedzierska, EOrzelska-Gòrka, JBielenica, ASantagada, VCaliendo, G Synthesis, in vitro and in vivo pharmacological evaluation of serotoninergic ligands containing an isonicotinic nucleus. Eur J Med Chem110:133-50 (2016) 
 
5-hydroxytryptamine receptor 2C
Name:5-hydroxytryptamine receptor 2C
Type:Enzyme
Mol. Mass.:51935.10
Organism:Rattus norvegicus (Rat)
Description:P08909
Residue:460
BDBM50145624
NameBDBM50145624
Synonyms:CHEMBL3764539
TypeSmall organic molecule
Emp. Form.C18H21ClN4O
Mol. Mass.344.839
SMILESClc1cccc(c1)N1CCN(CCNC(=O)c2ccncc2)CC1