Reaction Details
Target5-hydroxytryptamine receptor 1A
LigandBDBM50145628
Substrate/Competitorn/a
Meas. Tech.ChEMBL_1556024 (CHEMBL3767883)
Ki 549±n/a nM
Citation Fiorino, FCiano, AMagli, ESeverino, BCorvino, APerissutti, EFrecentese, FDi Vaio, PIzzo, AACapasso, RMassarelli, PNencini, CRossi, IKedzierska, EOrzelska-Gòrka, JBielenica, ASantagada, VCaliendo, G Synthesis, in vitro and in vivo pharmacological evaluation of serotoninergic ligands containing an isonicotinic nucleus. Eur J Med Chem110:133-50 (2016) 
 
5-hydroxytryptamine receptor 1A
Name:5-hydroxytryptamine receptor 1A
Type:G Protein-Coupled Receptor (GPCR)
Mol. Mass.:46445.29
Organism:Rattus norvegicus (rat)
Description:Binding assays were performed using rat hippocampal membranes.
Residue:422
BDBM50145628
NameBDBM50145628
Synonyms:CHEMBL3765231
TypeSmall organic molecule
Emp. Form.C18H21FN4O
Mol. Mass.328.3839
SMILESFc1ccc(cc1)N1CCN(CCNC(=O)c2ccncc2)CC1