Reaction Details
TargetMineralocorticoid receptor
LigandBDBM50145862
Substrate/Competitorn/a
Meas. Tech.ChEMBL_1553955 (CHEMBL3767967)
Ki 1840±n/a nM
Citation Saeed, AVaught, GMGavardinas, KMatthews, DGreen, JELosada, PGBullock, HACalvert, NAPatel, NJSweetana, SAKrishnan, VHenck, JWLuz, JGWang, YJadhav, P 2-Chloro-4-[[(1R,2R)-2-hydroxy-2-methyl-cyclopentyl]amino]-3-methyl-benzonitrile: A Transdermal Selective Androgen Receptor Modulator (SARM) for Muscle Atrophy. J Med Chem59:750-5 (2016) 
 
Mineralocorticoid receptor
Name:Mineralocorticoid receptor
Type:Enzyme
Mol. Mass.:107076.42
Organism:Homo sapiens (Human)
Description:P08235
Residue:984
BDBM50145862
NameBDBM50145862
Synonyms:CHEMBL3765171
TypeSmall organic molecule
Emp. Form.C14H17ClN2O
Mol. Mass.264.751
SMILESCc1c(N[C@@H]2CCC[C@]2(C)O)ccc(C#N)c1Cl