Reaction Details
TargetAndrogen receptor
LigandBDBM50145862
Substrate/Competitorn/a
Meas. Tech.ChEMBL_1553953 (CHEMBL3767965)
Ki 0.680000±n/a nM
Citation Saeed, AVaught, GMGavardinas, KMatthews, DGreen, JELosada, PGBullock, HACalvert, NAPatel, NJSweetana, SAKrishnan, VHenck, JWLuz, JGWang, YJadhav, P 2-Chloro-4-[[(1R,2R)-2-hydroxy-2-methyl-cyclopentyl]amino]-3-methyl-benzonitrile: A Transdermal Selective Androgen Receptor Modulator (SARM) for Muscle Atrophy. J Med Chem59:750-5 (2016) 
 
Androgen receptor
Name:Androgen receptor
Type:Receptor
Mol. Mass.:99185.27
Organism:Homo sapiens (Human)
Description:CHO cells were stably transfected with human AR gene.
Residue:920
BDBM50145862
NameBDBM50145862
Synonyms:CHEMBL3765171
TypeSmall organic molecule
Emp. Form.C14H17ClN2O
Mol. Mass.264.751
SMILESCc1c(N[C@@H]2CCC[C@]2(C)O)ccc(C#N)c1Cl