Reaction Details
TargetCholine kinase alpha
LigandBDBM50145947
Substrate/Competitorn/a
Meas. Tech.ChEMBL_1554161 (CHEMBL3769133)
IC50 268±n/a nM
Citation Zech, SGKohlmann, AZhou, TLi, FSquillace, RMParillon, LEGreenfield, MTMiller, DPQi, JThomas, RMWang, YXu, YMiret, JJShakespeare, WCZhu, XDalgarno, DC Novel Small Molecule Inhibitors of Choline Kinase Identified by Fragment-Based Drug Discovery. J Med Chem59:671-86 (2016) 
 
Choline kinase alpha
Name:Choline kinase alpha
Type:PROTEIN
Mol. Mass.:52248.44
Organism:Homo sapiens (Human)
Description:ChEMBL_1290064
Residue:457
BDBM50145947
NameBDBM50145947
Synonyms:CHEMBL3763792
TypeSmall organic molecule
Emp. Form.C26H37ClN4
Mol. Mass.441.052
SMILESCN1CCCN(Cc2ccc(cc2)-c2ccc(CN3CCCN(C)CC3)c(Cl)c2)CC1