Reaction Details
TargetHistone deacetylase
LigandBDBM50146076
Substrate/Competitorn/a
Meas. Tech.ChEMBL_1554286 (CHEMBL3766674)
IC50 21±n/a nM
Citation Rodrigues, DAFerreira-Silva, GÀFerreira, ACFernandes, RAKwee, JKSant'Anna, CMIonta, MFraga, CA Design, Synthesis, and Pharmacological Evaluation of Novel N-Acylhydrazone Derivatives as Potent Histone Deacetylase 6/8 Dual Inhibitors. J Med Chem59:655-70 (2016) 
 
Histone deacetylase
Name:Histone deacetylase
Type:PROTEIN
Mol. Mass.:34754.92
Organism:Rattus norvegicus
Description:ChEMBL_104809
Residue:328
BDBM50146076
NameBDBM50146076
Synonyms:CHEMBL3764525
TypeSmall organic molecule
Emp. Form.C17H18N4O3
Mol. Mass.326.3498
SMILESCN(C)c1ccc(cc1)C(=O)N\N=C\c1ccc(cc1)C(=O)NO