Reaction Details
TargetGlycogen phosphorylase, muscle form
LigandBDBM50146082
Substrate/Competitorn/a
Meas. Tech.ChEMBL_1554313 (CHEMBL3766852)
IC50 1540±n/a nM
Citation Goyard, DKónya, BChajistamatiou, ASChrysina, EDLeroy, JBalzarin, STournier, MTousch, DPetit, PDuret, CMaurel, PSomsák, LDocsa, TGergely, PPraly, JPAzay-Milhau, JVidal, S Glucose-derived spiro-isoxazolines are anti-hyperglycemic agents against type 2 diabetes through glycogen phosphorylase inhibition. Eur J Med Chem108:444-54 (2016) 
 
Glycogen phosphorylase, muscle form
Name:Glycogen phosphorylase, muscle form
Type:Enzyme
Mol. Mass.:97296.32
Organism:Oryctolagus cuniculus (rabbit)
Description:Phosphorylation of Ser-15 converts phosphorylase B (unphosphorylated) to phosphorylase A.
Residue:843
BDBM50146082
NameBDBM50146082
Synonyms:CHEMBL3763876
TypeSmall organic molecule
Emp. Form.C18H19NO7
Mol. Mass.361.346
SMILESOC[C@H]1O[C@@]2(CC(=NO2)c2ccc3cc(O)ccc3c2)[C@H](O)[C@@H](O)[C@@H]1O