Reaction Details
TargetGlycogen phosphorylase, muscle form
LigandBDBM50016703
Substrate/Competitorn/a
Meas. Tech.ChEMBL_1554314 (CHEMBL3766853)
Ki 400±n/a nM
Citation Goyard, DKónya, BChajistamatiou, ASChrysina, EDLeroy, JBalzarin, STournier, MTousch, DPetit, PDuret, CMaurel, PSomsák, LDocsa, TGergely, PPraly, JPAzay-Milhau, JVidal, S Glucose-derived spiro-isoxazolines are anti-hyperglycemic agents against type 2 diabetes through glycogen phosphorylase inhibition. Eur J Med Chem108:444-54 (2016) 
 
Glycogen phosphorylase, muscle form
Name:Glycogen phosphorylase, muscle form
Type:Enzyme
Mol. Mass.:97296.32
Organism:Oryctolagus cuniculus (rabbit)
Description:Phosphorylation of Ser-15 converts phosphorylase B (unphosphorylated) to phosphorylase A.
Residue:843
BDBM50016703
NameBDBM50016703
Synonyms:2-Hydroxymethyl-pyrrolidine-3,4-diol CHEMBL80254 | Imino-D-Arabinitol
TypeSmall organic molecule
Emp. Form.C5H11NO3
Mol. Mass.133.1457
SMILESOC[C@H]1NC[C@@H](O)[C@@H]1O