Reaction Details
TargetIndoleamine 2,3-dioxygenase 1
LigandBDBM50146446
Substrate/Competitorn/a
Meas. Tech.ChEMBL_1555048 (CHEMBL3767626)
IC50 2700±n/a nM
Citation Malachowski, WPWinters, MDuHadaway, JBLewis-Ballester, ABadir, SWai, JRahman, MSheikh, ELaLonde, JMYeh, SRPrendergast, GCMuller, AJ O-alkylhydroxylamines as rationally-designed mechanism-based inhibitors of indoleamine 2,3-dioxygenase-1. Eur J Med Chem108:564-76 (2016) 
 
Indoleamine 2,3-dioxygenase 1
Name:Indoleamine 2,3-dioxygenase 1
Type:Enzyme
Mol. Mass.:45330.80
Organism:Homo sapiens (Human)
Description:P14902
Residue:403
BDBM50146446
NameBDBM50146446
Synonyms:CHEMBL3765123
TypeSmall organic molecule
Emp. Form.C7H9ClN2O3
Mol. Mass.204.611
SMILESCl.NOCc1ccc(cc1)[N+]([O-])=O