Reaction Details
TargetCatalase
LigandBDBM50146460
Substrate/Competitorn/a
Meas. Tech.ChEMBL_1555051 (CHEMBL3767629)
IC50>100000±n/a nM
Citation Malachowski, WPWinters, MDuHadaway, JBLewis-Ballester, ABadir, SWai, JRahman, MSheikh, ELaLonde, JMYeh, SRPrendergast, GCMuller, AJ O-alkylhydroxylamines as rationally-designed mechanism-based inhibitors of indoleamine 2,3-dioxygenase-1. Eur J Med Chem108:564-76 (2016) 
 
Catalase
Name:Catalase
Type:PROTEIN
Mol. Mass.:59764.51
Organism:Homo sapiens (Human)
Description:ChEMBL_109916
Residue:527
BDBM50146460
NameBDBM50146460
Synonyms:CHEMBL3763688
TypeSmall organic molecule
Emp. Form.C7H9ClINO
Mol. Mass.285.51
SMILESCl.NOCc1ccc(I)cc1