Reaction Details
TargetCatalase
LigandBDBM50146461
Substrate/Competitorn/a
Meas. Tech.ChEMBL_1555051 (CHEMBL3767629)
IC50>100000±n/a nM
Citation Malachowski, WPWinters, MDuHadaway, JBLewis-Ballester, ABadir, SWai, JRahman, MSheikh, ELaLonde, JMYeh, SRPrendergast, GCMuller, AJ O-alkylhydroxylamines as rationally-designed mechanism-based inhibitors of indoleamine 2,3-dioxygenase-1. Eur J Med Chem108:564-76 (2016) 
 
Catalase
Name:Catalase
Type:PROTEIN
Mol. Mass.:59764.51
Organism:Homo sapiens (Human)
Description:ChEMBL_109916
Residue:527
BDBM50146461
NameBDBM50146461
Synonyms:CHEMBL3765807
TypeSmall organic molecule
Emp. Form.C7H9Cl2NO
Mol. Mass.194.058
SMILESCl.NOCc1cccc(Cl)c1