Reaction Details
TargetIndoleamine 2,3-dioxygenase 1
LigandBDBM50146460
Substrate/Competitorn/a
Meas. Tech.ChEMBL_1555057 (CHEMBL3767635)
IC50 180±n/a nM
Citation Malachowski, WPWinters, MDuHadaway, JBLewis-Ballester, ABadir, SWai, JRahman, MSheikh, ELaLonde, JMYeh, SRPrendergast, GCMuller, AJ O-alkylhydroxylamines as rationally-designed mechanism-based inhibitors of indoleamine 2,3-dioxygenase-1. Eur J Med Chem108:564-76 (2016) 
 
Indoleamine 2,3-dioxygenase 1
Name:Indoleamine 2,3-dioxygenase 1
Type:Enzyme
Mol. Mass.:45330.80
Organism:Homo sapiens (Human)
Description:P14902
Residue:403
BDBM50146460
NameBDBM50146460
Synonyms:CHEMBL3763688
TypeSmall organic molecule
Emp. Form.C7H9ClINO
Mol. Mass.285.51
SMILESCl.NOCc1ccc(I)cc1