Reaction Details
TargetIndoleamine 2,3-dioxygenase 1
LigandBDBM50146464
Substrate/Competitorn/a
Meas. Tech.ChEMBL_1555048 (CHEMBL3767626)
IC50 3400±n/a nM
Citation Malachowski, WPWinters, MDuHadaway, JBLewis-Ballester, ABadir, SWai, JRahman, MSheikh, ELaLonde, JMYeh, SRPrendergast, GCMuller, AJ O-alkylhydroxylamines as rationally-designed mechanism-based inhibitors of indoleamine 2,3-dioxygenase-1. Eur J Med Chem108:564-76 (2016) 
 
Indoleamine 2,3-dioxygenase 1
Name:Indoleamine 2,3-dioxygenase 1
Type:Enzyme
Mol. Mass.:45330.80
Organism:Homo sapiens (Human)
Description:P14902
Residue:403
BDBM50146464
NameBDBM50146464
Synonyms:CHEMBL3763237
TypeSmall organic molecule
Emp. Form.C7H8ClF2NO
Mol. Mass.195.594
SMILESCl.NOCc1cc(F)cc(F)c1