Reaction Details
TargetIndoleamine 2,3-dioxygenase 1
LigandBDBM50146581
Substrate/Competitorn/a
Meas. Tech.ChEMBL_1555048 (CHEMBL3767626)
IC50 10000±n/a nM
Citation Malachowski, WPWinters, MDuHadaway, JBLewis-Ballester, ABadir, SWai, JRahman, MSheikh, ELaLonde, JMYeh, SRPrendergast, GCMuller, AJ O-alkylhydroxylamines as rationally-designed mechanism-based inhibitors of indoleamine 2,3-dioxygenase-1. Eur J Med Chem108:564-76 (2016) 
 
Indoleamine 2,3-dioxygenase 1
Name:Indoleamine 2,3-dioxygenase 1
Type:Enzyme
Mol. Mass.:45330.80
Organism:Homo sapiens (Human)
Description:P14902
Residue:403
BDBM50146581
NameBDBM50146581
Synonyms:CHEMBL3764515
TypeSmall organic molecule
Emp. Form.C9H12ClNO
Mol. Mass.185.651
SMILESCl.NOC1Cc2ccccc2C1