Reaction Details
TargetSigma non-opioid intracellular receptor 1
LigandBDBM50179280
Substrate/Competitorn/a
Meas. Tech.ChEMBL_1555061 (CHEMBL3767807)
Ki 0.030000±n/a nM
Citation Abate, CRiganti, CPati, MLGhigo, DBerardi, FMavlyutov, TGuo, LWRuoho, A Development of sigma-1 (s1) receptor fluorescent ligands as versatile tools to studys1 receptors. Eur J Med Chem108:577-85 (2016) 
 
Sigma non-opioid intracellular receptor 1
Name:Sigma non-opioid intracellular receptor 1
Type:Protein
Mol. Mass.:25307.17
Organism:Cavia porcellus (Guinea pig)
Description:Q60492
Residue:223
BDBM50179280
NameBDBM50179280
Synonyms:1-(4-(6-methoxynaphthalen-1-yl)butyl)-4-methylpiperidine CHEMBL545278
TypeSmall organic molecule
Emp. Form.C21H29NO
Mol. Mass.311.4611
SMILESCOc1ccc2c(CCCCN3CCC(C)CC3)cccc2c1