Reaction Details
TargetSigma non-opioid intracellular receptor 1
LigandBDBM50299711
Substrate/Competitorn/a
Meas. Tech.ChEMBL_1555061 (CHEMBL3767807)
Ki 0.110000±n/a nM
Citation Abate, CRiganti, CPati, MLGhigo, DBerardi, FMavlyutov, TGuo, LWRuoho, A Development of sigma-1 (s1) receptor fluorescent ligands as versatile tools to studys1 receptors. Eur J Med Chem108:577-85 (2016) 
 
Sigma non-opioid intracellular receptor 1
Name:Sigma non-opioid intracellular receptor 1
Type:Protein
Mol. Mass.:25307.17
Organism:Cavia porcellus (Guinea pig)
Description:Q60492
Residue:223
BDBM50299711
NameBDBM50299711
Synonyms:4-Cyclohexyl-1-[3-(5-methoxy-1,2,3,4-tetrahydronaphthalen-1-yl)propionyl]piperazine | CHEMBL573234
TypeSmall organic molecule
Emp. Form.C24H36N2O2
Mol. Mass.384.5548
SMILESCOc1cccc2C(CCC(=O)N3CCN(CC3)C3CCCCC3)CCCc12