Reaction Details
TargetCereblon isoform 4
LigandBDBM50146597
Substrate/Competitorn/a
Meas. Tech.ChEMBL_1555515 (CHEMBL3768097)
IC50 48900±n/a nM
Citation Boichenko, IDeiss, SBär, KHartmann, MDHernandez Alvarez, B A FRET-Based Assay for the Identification and Characterization of Cereblon Ligands. J Med Chem59:770-4 (2016) 
 
Cereblon isoform 4
Name:Cereblon isoform 4
Synonyms:Cereblon isoform 4
Type:PROTEIN
Mol. Mass.:13620.40
Organism:Magnetospirillum gryphiswaldense
Description:ChEMBL_116733
Residue:124
BDBM50146597
NameBDBM50146597
Synonyms:CHEMBL3763941
TypeSmall organic molecule
Emp. Form.C5H7NO2
Mol. Mass.113.1146
SMILESO=C1CCCC(=O)N1