Reaction Details
TargetCarbonic anhydrase 1
LigandBDBM50146827
Substrate/Competitorn/a
Meas. Tech.ChEMBL_1555756 (CHEMBL3766367)
Ki>10000±n/a nM
Citation Cornelio, BLaronze-Cochard, MCeruso, MFerraroni, MRance, GACarta, FKhlobystov, ANFontana, ASupuran, CTSapi, J 4-Arylbenzenesulfonamides as Human Carbonic Anhydrase Inhibitors (hCAIs): Synthesis by Pd Nanocatalyst-Mediated Suzuki-Miyaura Reaction, Enzyme Inhibition, and X-ray Crystallographic Studies. J Med Chem59:721-32 (2016) 
 
Carbonic anhydrase 1
Name:Carbonic anhydrase 1
Type:Enzyme
Mol. Mass.:28873.37
Organism:Homo sapiens (Human)
Description:P00915
Residue:261
BDBM50146827
NameBDBM50146827
Synonyms:CHEMBL3764569
TypeSmall organic molecule
Emp. Form.C20H16N2O4S2
Mol. Mass.412.482
SMILESNS(=O)(=O)c1ccc(cc1)-c1cc2ccccc2n1S(=O)(=O)c1ccccc1