Reaction Details
TargetCarbonic anhydrase 2
LigandBDBM210937
Substrate/Competitorn/a
Meas. Tech.ChEMBL_1555757 (CHEMBL3766368)
Ki 2.1±n/a nM
Citation Cornelio, BLaronze-Cochard, MCeruso, MFerraroni, MRance, GACarta, FKhlobystov, ANFontana, ASupuran, CTSapi, J 4-Arylbenzenesulfonamides as Human Carbonic Anhydrase Inhibitors (hCAIs): Synthesis by Pd Nanocatalyst-Mediated Suzuki-Miyaura Reaction, Enzyme Inhibition, and X-ray Crystallographic Studies. J Med Chem59:721-32 (2016) 
 
Carbonic anhydrase 2
Name:Carbonic anhydrase 2
Type:Enzyme
Mol. Mass.:29250.71
Organism:Homo sapiens (Human)
Description:P00918
Residue:260
BDBM210937
NameBDBM210937
Synonyms:4-(3-formylphenyl)-benzenesulfonamide (4e)
TypeSmall organic molecule
Emp. Form.C13H11NO3S
Mol. Mass.261.296
SMILESNS(=O)(=O)c1ccc(cc1)-c1cccc(C=O)c1