Reaction Details
TargetCarbonic anhydrase 2
LigandBDBM210938
Substrate/Competitorn/a
Meas. Tech.ChEMBL_1555757 (CHEMBL3766368)
Ki 2.5±n/a nM
Citation Cornelio, BLaronze-Cochard, MCeruso, MFerraroni, MRance, GACarta, FKhlobystov, ANFontana, ASupuran, CTSapi, J 4-Arylbenzenesulfonamides as Human Carbonic Anhydrase Inhibitors (hCAIs): Synthesis by Pd Nanocatalyst-Mediated Suzuki-Miyaura Reaction, Enzyme Inhibition, and X-ray Crystallographic Studies. J Med Chem59:721-32 (2016) 
 
Carbonic anhydrase 2
Name:Carbonic anhydrase 2
Type:Enzyme
Mol. Mass.:29250.71
Organism:Homo sapiens (Human)
Description:P00918
Residue:260
BDBM210938
NameBDBM210938
Synonyms:4-(3-quinolinyl)-benzenesulfonamide (4p)
TypeSmall organic molecule
Emp. Form.C15H12N2O2S
Mol. Mass.284.333
SMILESNS(=O)(=O)c1ccc(cc1)-c1cnc2ccccc2c1