Reaction Details
TargetCarbonic anhydrase 9
LigandBDBM50146831
Substrate/Competitorn/a
Meas. Tech.ChEMBL_1555758 (CHEMBL3766369)
Ki 0.370000±n/a nM
Citation Cornelio, BLaronze-Cochard, MCeruso, MFerraroni, MRance, GACarta, FKhlobystov, ANFontana, ASupuran, CTSapi, J 4-Arylbenzenesulfonamides as Human Carbonic Anhydrase Inhibitors (hCAIs): Synthesis by Pd Nanocatalyst-Mediated Suzuki-Miyaura Reaction, Enzyme Inhibition, and X-ray Crystallographic Studies. J Med Chem59:721-32 (2016) 
 
Carbonic anhydrase 9
Name:Carbonic anhydrase 9
Type:Enzyme
Mol. Mass.:49669.03
Organism:Homo sapiens (Human)
Description:Catalytic domain of human cloned isozyme was used in the assay
Residue:459
BDBM50146831
NameBDBM50146831
Synonyms:CHEMBL3763167
TypeSmall organic molecule
Emp. Form.C14H11NO3S
Mol. Mass.273.307
SMILESNS(=O)(=O)c1ccc(cc1)-c1cc2ccccc2o1