Reaction Details
TargetCarbonic anhydrase 12
LigandBDBM50146825
Substrate/Competitorn/a
Meas. Tech.ChEMBL_1555759 (CHEMBL3766370)
Ki 97±n/a nM
Citation Cornelio, BLaronze-Cochard, MCeruso, MFerraroni, MRance, GACarta, FKhlobystov, ANFontana, ASupuran, CTSapi, J 4-Arylbenzenesulfonamides as Human Carbonic Anhydrase Inhibitors (hCAIs): Synthesis by Pd Nanocatalyst-Mediated Suzuki-Miyaura Reaction, Enzyme Inhibition, and X-ray Crystallographic Studies. J Med Chem59:721-32 (2016) 
 
Carbonic anhydrase 12
Name:Carbonic anhydrase 12
Type:Enzyme
Mol. Mass.:39456.00
Organism:Homo sapiens (Human)
Description:Catalytic domain of human cloned isozyme was used in the assay
Residue:354
BDBM50146825
NameBDBM50146825
Synonyms:CHEMBL3765197
TypeSmall organic molecule
Emp. Form.C20H16N2O4S2
Mol. Mass.412.482
SMILESNS(=O)(=O)c1ccc(cc1)-c1cn(c2ccccc12)S(=O)(=O)c1ccccc1