Reaction Details
TargetCarbonic anhydrase 1
LigandBDBM50147170
Substrate/Competitorn/a
Meas. Tech.ChEMBL_1554385 (CHEMBL3767219)
Ki 8.5±n/a nM
Citation Eldehna, WMFares, MCeruso, MGhabbour, HAAbou-Seri, SMAbdel-Aziz, HAAbou El Ella, DASupuran, CT Amido/ureidosubstituted benzenesulfonamides-isatin conjugates as low nanomolar/subnanomolar inhibitors of the tumor-associated carbonic anhydrase isoform XII. Eur J Med Chem110:259-66 (2016) 
 
Carbonic anhydrase 1
Name:Carbonic anhydrase 1
Type:Enzyme
Mol. Mass.:28873.37
Organism:Homo sapiens (Human)
Description:P00915
Residue:261
BDBM50147170
NameBDBM50147170
Synonyms:CHEMBL3765390
TypeSmall organic molecule
Emp. Form.C22H18N4O4S
Mol. Mass.434.468
SMILESCc1ccc2NC(=O)\C(=N/c3ccc(cc3)C(=O)Nc3ccc(cc3)S(N)(=O)=O)c2c1