Reaction Details
TargetCarbonic anhydrase 2
LigandBDBM50147166
Substrate/Competitorn/a
Meas. Tech.ChEMBL_1554386 (CHEMBL3767220)
Ki 7.7±n/a nM
Citation Eldehna, WMFares, MCeruso, MGhabbour, HAAbou-Seri, SMAbdel-Aziz, HAAbou El Ella, DASupuran, CT Amido/ureidosubstituted benzenesulfonamides-isatin conjugates as low nanomolar/subnanomolar inhibitors of the tumor-associated carbonic anhydrase isoform XII. Eur J Med Chem110:259-66 (2016) 
 
Carbonic anhydrase 2
Name:Carbonic anhydrase 2
Type:Enzyme
Mol. Mass.:29250.71
Organism:Homo sapiens (Human)
Description:P00918
Residue:260
BDBM50147166
NameBDBM50147166
Synonyms:CHEMBL3763581
TypeSmall organic molecule
Emp. Form.C21H15FN4O4S
Mol. Mass.438.432
SMILESNS(=O)(=O)c1ccc(NC(=O)c2ccc(cc2)\N=C2/C(=O)Nc3ccc(F)cc23)cc1