Reaction Details
TargetCarbonic anhydrase 9
LigandBDBM50147169
Substrate/Competitorn/a
Meas. Tech.ChEMBL_1554387 (CHEMBL3767221)
Ki 237±n/a nM
Citation Eldehna, WMFares, MCeruso, MGhabbour, HAAbou-Seri, SMAbdel-Aziz, HAAbou El Ella, DASupuran, CT Amido/ureidosubstituted benzenesulfonamides-isatin conjugates as low nanomolar/subnanomolar inhibitors of the tumor-associated carbonic anhydrase isoform XII. Eur J Med Chem110:259-66 (2016) 
 
Carbonic anhydrase 9
Name:Carbonic anhydrase 9
Type:Enzyme
Mol. Mass.:49669.03
Organism:Homo sapiens (Human)
Description:Catalytic domain of human cloned isozyme was used in the assay
Residue:459
BDBM50147169
NameBDBM50147169
Synonyms:CHEMBL3765409
TypeSmall organic molecule
Emp. Form.C21H15N5O6S
Mol. Mass.465.439
SMILESNS(=O)(=O)c1ccc(NC(=O)c2ccc(cc2)\N=C2/C(=O)Nc3ccc(cc23)[N+]([O-])=O)cc1