Reaction Details
TargetDiacylglycerol lipase-alpha
LigandBDBM50148154
Substrate/Competitorn/a
Meas. Tech.ChEMBL_1553495 (CHEMBL3768666)
IC50 4±n/a nM
Citation Chupak, LSZheng, XHu, SHuang, YDing, MLewis, MAWestphal, RSBlat, YMcClure, AGentles, RG Structure activity relationship studies on chemically non-reactive glycine sulfonamide inhibitors of diacylglycerol lipase. Bioorg Med Chem24:1455-68 (2016) 
 
Diacylglycerol lipase-alpha
Name:Diacylglycerol lipase-alpha
Type:PROTEIN
Mol. Mass.:114947.74
Organism:Homo sapiens (Human)
Description:ChEMBL_1449471
Residue:1042
BDBM50148154
NameBDBM50148154
Synonyms:CHEMBL3763831
TypeSmall organic molecule
Emp. Form.C24H20Cl3NO4S
Mol. Mass.524.844
SMILESOC(=O)CN(C1(CCC1)c1cccc(c1)-c1cc(Cl)cc(Cl)c1)S(=O)(=O)c1ccc(Cl)cc1