Reaction Details
TargetDiacylglycerol lipase-alpha
LigandBDBM50148155
Substrate/Competitorn/a
Meas. Tech.ChEMBL_1553495 (CHEMBL3768666)
IC50 18±n/a nM
Citation Chupak, LSZheng, XHu, SHuang, YDing, MLewis, MAWestphal, RSBlat, YMcClure, AGentles, RG Structure activity relationship studies on chemically non-reactive glycine sulfonamide inhibitors of diacylglycerol lipase. Bioorg Med Chem24:1455-68 (2016) 
 
Diacylglycerol lipase-alpha
Name:Diacylglycerol lipase-alpha
Type:PROTEIN
Mol. Mass.:114947.74
Organism:Homo sapiens (Human)
Description:ChEMBL_1449471
Residue:1042
BDBM50148155
NameBDBM50148155
Synonyms:CHEMBL3765573
TypeSmall organic molecule
Emp. Form.C23H19Cl2F2NO5S
Mol. Mass.530.368
SMILESC[C@H](N(CC(O)=O)S(=O)(=O)c1ccc(OC(F)F)cc1)c1ccc(cc1)-c1ccc(Cl)cc1Cl