Reaction Details
TargetDiacylglycerol lipase-alpha
LigandBDBM50048620
Substrate/Competitorn/a
Meas. Tech.ChEMBL_1553499 (CHEMBL3768670)
IC50 18±n/a nM
Citation Chupak, LSZheng, XHu, SHuang, YDing, MLewis, MAWestphal, RSBlat, YMcClure, AGentles, RG Structure activity relationship studies on chemically non-reactive glycine sulfonamide inhibitors of diacylglycerol lipase. Bioorg Med Chem24:1455-68 (2016) 
 
Diacylglycerol lipase-alpha
Name:Diacylglycerol lipase-alpha
Type:PROTEIN
Mol. Mass.:114947.74
Organism:Homo sapiens (Human)
Description:ChEMBL_1449471
Residue:1042
BDBM50048620
NameBDBM50048620
Synonyms:CHEMBL3319620
TypeSmall organic molecule
Emp. Form.C26H27NO6S
Mol. Mass.481.561
SMILESCC1(C)CCc2cc(ccc2O1)S(=O)(=O)N(CC(O)=O)Cc1ccc(Oc2ccccc2)cc1