Reaction Details
TargetDiacylglycerol lipase-alpha
LigandBDBM50148184
Substrate/Competitorn/a
Meas. Tech.ChEMBL_1553309 (CHEMBL3767698)
IC50 14±n/a nM
Citation Chupak, LSZheng, XHu, SHuang, YDing, MLewis, MAWestphal, RSBlat, YMcClure, AGentles, RG Structure activity relationship studies on chemically non-reactive glycine sulfonamide inhibitors of diacylglycerol lipase. Bioorg Med Chem24:1455-68 (2016) 
 
Diacylglycerol lipase-alpha
Name:Diacylglycerol lipase-alpha
Type:PROTEIN
Mol. Mass.:114947.74
Organism:Homo sapiens (Human)
Description:ChEMBL_1449471
Residue:1042
BDBM50148184
NameBDBM50148184
Synonyms:CHEMBL3763853
TypeSmall organic molecule
Emp. Form.C22H17Cl2F2NO5S
Mol. Mass.516.342
SMILESOC(=O)CN(Cc1cccc(c1)-c1cccc(Cl)c1Cl)S(=O)(=O)c1ccc(OC(F)F)cc1