Reaction Details
TargetDiacylglycerol lipase-alpha
LigandBDBM24567
Substrate/Competitorn/a
Meas. Tech.ChEMBL_1553497 (CHEMBL3768668)
IC50 20±n/a nM
Citation Chupak, LSZheng, XHu, SHuang, YDing, MLewis, MAWestphal, RSBlat, YMcClure, AGentles, RG Structure activity relationship studies on chemically non-reactive glycine sulfonamide inhibitors of diacylglycerol lipase. Bioorg Med Chem24:1455-68 (2016) 
 
Diacylglycerol lipase-alpha
Name:Diacylglycerol lipase-alpha
Type:PROTEIN
Mol. Mass.:115371.22
Organism:Mus musculus
Description:ChEMBL_101098
Residue:1044
BDBM24567
NameBDBM24567
Synonyms:(2S)-1-[(2S,3S)-3-hexyl-4-oxooxetan-2-yl]tridecan-2-yl (2S)-2-formamido-4-methylpentanoate Orlistat Tetrahydrolipstatin Xenical
TypeSmall organic molecule
Emp. Form.C29H53NO5
Mol. Mass.495.7348
SMILESCCCCCCCCCCC[C@@H](C[C@@H]1OC(=O)[C@H]1CCCCCC)OC(=O)[C@H](CC(C)C)NC=O