Reaction Details
TargetPhosphatidylinositol 4,5-bisphosphate 3-kinase catalytic subunit alpha isoform
LigandBDBM50147684
Substrate/Competitorn/a
Meas. Tech.ChEMBL_1554928 (CHEMBL3767080)
IC50 2800±n/a nM
Citation Morrison, RAl-Rawi, JMJennings, IGThompson, PEAngove, MJ Synthesis, structure elucidation, DNA-PK and PI3K and anti-cancer activity of 8- and 6-aryl-substituted-1-3-benzoxazines. Eur J Med Chem110:326-39 (2016) 
 
Phosphatidylinositol 4,5-bisphosphate 3-kinase catalytic subunit alpha isoform
Name:Phosphatidylinositol 4,5-bisphosphate 3-kinase catalytic subunit alpha isoform
Type:Enzyme Subunit
Mol. Mass.:124294.87
Organism:Homo sapiens (Human)
Description:P42336
Residue:1068
BDBM50147684
NameBDBM50147684
Synonyms:CHEMBL3765105
TypeSmall organic molecule
Emp. Form.C19H18N2O4
Mol. Mass.338.3572
SMILESCOc1ccc(cc1)-c1cccc2c1oc(nc2=O)N1CCOCC1