Reaction Details
TargetPhosphatidylinositol 4,5-bisphosphate 3-kinase catalytic subunit beta isoform
LigandBDBM50147688
Substrate/Competitorn/a
Meas. Tech.ChEMBL_1554930 (CHEMBL3767082)
IC50 3200±n/a nM
Citation Morrison, RAl-Rawi, JMJennings, IGThompson, PEAngove, MJ Synthesis, structure elucidation, DNA-PK and PI3K and anti-cancer activity of 8- and 6-aryl-substituted-1-3-benzoxazines. Eur J Med Chem110:326-39 (2016) 
 
Phosphatidylinositol 4,5-bisphosphate 3-kinase catalytic subunit beta isoform
Name:Phosphatidylinositol 4,5-bisphosphate 3-kinase catalytic subunit beta isoform
Type:Enzyme Subunit
Mol. Mass.:122769.00
Organism:Homo sapiens (Human)
Description:P42338
Residue:1070
BDBM50147688
NameBDBM50147688
Synonyms:CHEMBL3763205
TypeSmall organic molecule
Emp. Form.C19H18N2O4
Mol. Mass.338.3572
SMILESOCc1ccc(cc1)-c1cccc2c1oc(nc2=O)N1CCOCC1