Reaction Details
TargetPantothenate synthetase
LigandBDBM50147693
Substrate/Competitorn/a
Meas. Tech.ChEMBL_1555395 (CHEMBL3766329)
IC50 1100±n/a nM
Citation Samala, GDevi, PBSaxena, SMeda, NYogeeswari, PSriram, D Design, synthesis and biological evaluation of imidazo[2,1-b]thiazole and benzo[d]imidazo[2,1-b]thiazole derivatives as Mycobacterium tuberculosis pantothenate synthetase inhibitors. Bioorg Med Chem24:1298-307 (2016) 
 
Pantothenate synthetase
Name:Pantothenate synthetase
Type:n/a
Mol. Mass.:32675.10
Organism:Mycobacterium tuberculosis (strain ATCC 25618 / H37Rv)
Description:ChEMBL_102878
Residue:309
BDBM50147693
NameBDBM50147693
Synonyms:CHEMBL3763613
TypeSmall organic molecule
Emp. Form.C18H14N4O2S
Mol. Mass.350.394
SMILESCc1nc2sc3ccccc3n2c1C(=O)NNC(=O)c1ccccc1