Reaction Details
TargetCarbonic anhydrase 1
LigandBDBM50147755
Substrate/Competitorn/a
Meas. Tech.ChEMBL_1555887 (CHEMBL3767104)
Ki>10000±n/a nM
Citation Alafeefy, AMCarta, FCeruso, MAl-Tamimi, AMAl-Kahtani, AASupuran, CT Development of 3-(4-aminosulphonyl)-phenyl-2-mercapto-3H-quinazolin-4-ones as inhibitors of carbonic anhydrase isoforms involved in tumorigenesis and glaucoma. Bioorg Med Chem24:1402-7 (2016) 
 
Carbonic anhydrase 1
Name:Carbonic anhydrase 1
Type:Enzyme
Mol. Mass.:28873.37
Organism:Homo sapiens (Human)
Description:P00915
Residue:261
BDBM50147755
NameBDBM50147755
Synonyms:CHEMBL3764423
TypeSmall organic molecule
Emp. Form.C15H13N3O4S2
Mol. Mass.363.411
SMILESCOc1ccc2c(c1)nc(S)n(-c1ccc(cc1)S(N)(=O)=O)c2=O