Reaction Details
TargetCarbonic anhydrase 2
LigandBDBM50147759
Substrate/Competitorn/a
Meas. Tech.ChEMBL_1555888 (CHEMBL3767105)
Ki 5.9±n/a nM
Citation Alafeefy, AMCarta, FCeruso, MAl-Tamimi, AMAl-Kahtani, AASupuran, CT Development of 3-(4-aminosulphonyl)-phenyl-2-mercapto-3H-quinazolin-4-ones as inhibitors of carbonic anhydrase isoforms involved in tumorigenesis and glaucoma. Bioorg Med Chem24:1402-7 (2016) 
 
Carbonic anhydrase 2
Name:Carbonic anhydrase 2
Type:Enzyme
Mol. Mass.:29250.71
Organism:Homo sapiens (Human)
Description:P00918
Residue:260
BDBM50147759
NameBDBM50147759
Synonyms:CHEMBL3765657
TypeSmall organic molecule
Emp. Form.C15H13N3O3S2
Mol. Mass.347.412
SMILESCc1cccc2c1nc(S)n(-c1ccc(cc1)S(N)(=O)=O)c2=O