Reaction Details
TargetCarbonic anhydrase 2
LigandBDBM50147757
Substrate/Competitorn/a
Meas. Tech.ChEMBL_1555888 (CHEMBL3767105)
Ki 11±n/a nM
Citation Alafeefy, AMCarta, FCeruso, MAl-Tamimi, AMAl-Kahtani, AASupuran, CT Development of 3-(4-aminosulphonyl)-phenyl-2-mercapto-3H-quinazolin-4-ones as inhibitors of carbonic anhydrase isoforms involved in tumorigenesis and glaucoma. Bioorg Med Chem24:1402-7 (2016) 
 
Carbonic anhydrase 2
Name:Carbonic anhydrase 2
Type:Enzyme
Mol. Mass.:29250.71
Organism:Homo sapiens (Human)
Description:P00918
Residue:260
BDBM50147757
NameBDBM50147757
Synonyms:CHEMBL3764536
TypeSmall organic molecule
Emp. Form.C16H15N3O3S2
Mol. Mass.361.439
SMILESCc1cc(C)c2nc(S)n(-c3ccc(cc3)S(N)(=O)=O)c(=O)c2c1