Reaction Details
TargetCarbonic anhydrase 9
LigandBDBM50147764
Substrate/Competitorn/a
Meas. Tech.ChEMBL_1555889 (CHEMBL3767106)
Ki 163±n/a nM
Citation Alafeefy, AMCarta, FCeruso, MAl-Tamimi, AMAl-Kahtani, AASupuran, CT Development of 3-(4-aminosulphonyl)-phenyl-2-mercapto-3H-quinazolin-4-ones as inhibitors of carbonic anhydrase isoforms involved in tumorigenesis and glaucoma. Bioorg Med Chem24:1402-7 (2016) 
 
Carbonic anhydrase 9
Name:Carbonic anhydrase 9
Type:Enzyme
Mol. Mass.:49669.03
Organism:Homo sapiens (Human)
Description:Catalytic domain of human cloned isozyme was used in the assay
Residue:459
BDBM50147764
NameBDBM50147764
Synonyms:CHEMBL3764181
TypeSmall organic molecule
Emp. Form.C14H10BrN3O3S2
Mol. Mass.412.282
SMILESNS(=O)(=O)c1ccc(cc1)-n1c(S)nc2cc(Br)ccc2c1=O